Target
Mast/stem cell growth factor receptor Kit
Ligand
BDBM13533
Substrate
biotinylated affinity ligand
Meas. Tech.
Kinase Inhibitor Selectivity Profiling Assay
Ki
230000±n/a nM
Citation
 PubChem, PC Kinase Inhibitor Selectivity Profiling Assay PubChem Bioassay (2008)[AID] 
Target
Name:
Mast/stem cell growth factor receptor Kit
Synonyms:
CD117 antigen KIT Mast/stem cell growth factor receptor Kit (cKIT) Proto-oncogene tyrosine-protein kinase Kit Stem cell growth factor receptor Tyrosine-protein kinase Kit c-kit v-kit Hardy-Zuckerman 4 feline sarcoma viral oncogene homolog
Type:
Protein
Mol. Mass.:
109869.37
Organism:
Homo sapiens (Human)
Description:
P10721
Residue:
976
  
Inhibitor
Name:
BDBM13533
Synonyms:
1-[2-(4-methylphenyl)-5-tert-butyl-pyrazol-3-yl]-3-[4-(2-morpholin-4-ylethoxy)naphthalen-1-yl]urea 1-[5-tert-butyl-2-(4-methylphenyl)pyrazol-3-yl]-3-[4-(2-morpholin-4-ylethoxy)naphthalen-1-yl]urea 3-[2-(4-methylphenyl)-5-tert-butyl-pyrazol-3-yl]-1-[4-(2-morpholin-4-ylethoxy)naphthalen-1-yl]urea BIRB 796 BIRB-796, 3 D3RKN_73 US11407771, Compound 43 US9187470, 43 (BIRB-796) US9260410, BIRB796 diaryl urea compound 10
Type:
Small organic molecule
Emp. Form.:
C31H37N5O3
Mol. Mass.:
527.6572
SMILES:
Cc1ccc(cc1)-n1nc(cc1NC(=O)Nc1ccc(OCCN2CCOCC2)c2ccccc12)C(C)(C)C
:
Substrate
Name:
biotinylated affinity ligand
Synonyms:
Type:
Mol. Mass.:
358.43
Organism:
Description:
Residue:
3
NA