Target
Mast/stem cell growth factor receptor Kit
Ligand
BDBM13534
Substrate
biotinylated affinity ligand
Meas. Tech.
Kinase Inhibitor Selectivity Profiling Assay
Ki
240000±n/a nM
Citation
 PubChem, PC Kinase Inhibitor Selectivity Profiling Assay PubChem Bioassay (2008)[AID] 
Target
Name:
Mast/stem cell growth factor receptor Kit
Synonyms:
CD117 antigen KIT Mast/stem cell growth factor receptor Kit (cKIT) Proto-oncogene tyrosine-protein kinase Kit Stem cell growth factor receptor Tyrosine-protein kinase Kit c-kit v-kit Hardy-Zuckerman 4 feline sarcoma viral oncogene homolog
Type:
Protein
Mol. Mass.:
109869.37
Organism:
Homo sapiens (Human)
Description:
P10721
Residue:
976
  
Inhibitor
Name:
BDBM13534
Synonyms:
CHEMBL572878 N-[4-[[4-(4-methylpiperazino)-6-[(5-methyl-1H-pyrazol-3-yl)amino]pyrimidin-2-yl]thio]phenyl]cyclopropanecarboxamide VX680 | cyclopropane carboxylic acid {4-[4-(4-methyl-piperazin-1-yl)-6-(5-methyl-2H-pyrazol-3-ylamino)-pyrimidin-2ylsulphanyl]-phenyl}-amide
Type:
Small organic molecule
Emp. Form.:
C23H28N8OS
Mol. Mass.:
464.586
SMILES:
CN1CCN(CC1)c1cc(Nc2cc(C)n[nH]2)nc(Sc2ccc(NC(=O)C3CC3)cc2)n1
:
Substrate
Name:
biotinylated affinity ligand
Synonyms:
Type:
Mol. Mass.:
358.43
Organism:
Description:
Residue:
3
NA