Target
Runt-related transcription factor 1
Ligand
BDBM31176
Substrate
Venus-CBFbeta-SMMHC
Meas. Tech.
FRET Assay
IC50
12000±n/a nM
Citation
 Gorczynski, MJGrembecka, JZhou, YKong, YRoudaia, LDouvas, MGNewman, MBielnicka, IBaber, GCorpora, TShi, JSridharan, MLilien, RDonald, BRSpeck, NABrown, MLBushweller, JH Allosteric inhibition of the protein-protein interaction between the leukemia-associated proteins Runx1 and CBFbeta. Chem Biol 14:1186-97 (2007)  
Target
Name:
Runt-related transcription factor 1
Synonyms:
AML1 CBF-alpha-2 Core-binding factor subunit alpha-2 Polyomavirus enhancer-binding protein 2 alpha B subunit RUNX1_HUMAN | Runt-Related Transcription Factor 1 Isoform AML1C
Type:
Subunit of heterodimeric transcription factor
Mol. Mass.:
48750.25
Organism:
Homo sapiens (Human)
Description:
Q01196
Residue:
453
  
Inhibitor
Name:
BDBM31176
Synonyms:
thiazol-2-amine, 6
Type:
Small organic molecule
Emp. Form.:
C10H10N2OS
Mol. Mass.:
206.264
SMILES:
COc1ccc(cc1)-c1csc(N)n1
:
Substrate
Name:
Core-binding factor subunit beta isoform 2
Synonyms:
CBFB PEBB_HUMAN Venus-core-binding factor subunit beta-smooth muscle myosin heavy chain
Type:
Fluorescent fusion protein
Mol. Mass.:
21988.19
Organism:
Homo sapiens (Human)
Description:
Q13951-2
Residue:
187