Target
5-hydroxytryptamine receptor 1E
Ligand
BDBM31002
Substrate
Not Available
Meas. Tech.
Dose Response Cell Based High Throughput Screening Assay for Agonists of the 5-Hydroxytryptamine Receptor Subtype 1E (5HT1E)
pH
7.4±n/a
Temperature
296.15±n/a K
EC50
50000±n/a nM
Citation
 PubChem, PC Dose Response Cell Based High Throughput Screening Assay for Agonists of the 5-Hydroxytryptamine Receptor Subtype 1E (5HT1E) PubChem Bioassay (2007)[AID] 
Target
Name:
5-hydroxytryptamine receptor 1E
Synonyms:
5-HT-1E 5-Hydroxytryptamine Receptor Subtype 1E (5HT1E) 5-hydroxytryptamine receptor 1E (5-HT-1E) (S31) 5HT1E_HUMAN S31 Serotonin 1e (5-HT1e) receptor | Serotonin Receptor 1E
Type:
G Protein-Coupled Receptor (GPCR)
Mol. Mass.:
41697.80
Organism:
Homo sapiens (Human)
Description:
gi_112822
Residue:
365
  
Inhibitor
Name:
BDBM31002
Synonyms:
2-(1-Methyl-5-phenyl-1H-imidazol-2-ylsulfanylmethyl)-3H-quinazolin-4-one 2-[(1-methyl-5-phenylimidazol-2-yl)sulfanylmethyl]-1H-quinazolin-4-one 2-[[(1-methyl-5-phenyl-imidazol-2-yl)thio]methyl]-1H-quinazolin-4-one SMR000002521 | cid_648716
Type:
Small organic molecule
Emp. Form.:
C19H16N4OS
Mol. Mass.:
348.422
SMILES:
Cn1c(SCc2nc3ccccc3c(=O)[nH]2)ncc1-c1ccccc1
:
Substrate
Name:
Not Available
Synonyms:
Type:
Mol. Mass.:
358.43
Organism:
Description:
Residue:
3
NA