Target
5-hydroxytryptamine receptor 1E
Ligand
BDBM31009
Substrate
Not Available
Meas. Tech.
Dose Response Cell Based High Throughput Screening Assay for Agonists of the 5-Hydroxytryptamine Receptor Subtype 1E (5HT1E)
pH
7.4±n/a
Temperature
296.15±n/a K
EC50
50000±n/a nM
Citation
 PubChem, PC Dose Response Cell Based High Throughput Screening Assay for Agonists of the 5-Hydroxytryptamine Receptor Subtype 1E (5HT1E) PubChem Bioassay (2007)[AID] 
Target
Name:
5-hydroxytryptamine receptor 1E
Synonyms:
5-HT-1E 5-Hydroxytryptamine Receptor Subtype 1E (5HT1E) 5-hydroxytryptamine receptor 1E (5-HT-1E) (S31) 5HT1E_HUMAN S31 Serotonin 1e (5-HT1e) receptor | Serotonin Receptor 1E
Type:
G Protein-Coupled Receptor (GPCR)
Mol. Mass.:
41697.80
Organism:
Homo sapiens (Human)
Description:
gi_112822
Residue:
365
  
Inhibitor
Name:
BDBM31009
Synonyms:
1-[3-[1-cyano-2-(cyclohexylamino)-2-keto-ethyl]quinoxalin-2-yl]isonipecotamide 1-[3-[1-cyano-2-(cyclohexylamino)-2-oxoethyl]-2-quinoxalinyl]-4-piperidinecarboxamide MLS000079941 cid_660662
Type:
Small organic molecule
Emp. Form.:
C23H28N6O2
Mol. Mass.:
420.5074
SMILES:
NC(=O)C1CCN(CC1)c1nc2ccccc2nc1C(C#N)C(=O)NC1CCCCC1
:
Substrate
Name:
Not Available
Synonyms:
Type:
Mol. Mass.:
358.43
Organism:
Description:
Residue:
3
NA