Target
5-hydroxytryptamine receptor 1E
Ligand
BDBM31022
Substrate
Not Available
Meas. Tech.
Dose Response Cell Based High Throughput Screening Assay for Agonists of the 5-Hydroxytryptamine Receptor Subtype 1E (5HT1E)
pH
7.4±n/a
Temperature
296.15±n/a K
EC50
50000±n/a nM
Citation
 PubChem, PC Dose Response Cell Based High Throughput Screening Assay for Agonists of the 5-Hydroxytryptamine Receptor Subtype 1E (5HT1E) PubChem Bioassay (2007)[AID] 
Target
Name:
5-hydroxytryptamine receptor 1E
Synonyms:
5-HT-1E 5-Hydroxytryptamine Receptor Subtype 1E (5HT1E) 5-hydroxytryptamine receptor 1E (5-HT-1E) (S31) 5HT1E_HUMAN S31 Serotonin 1e (5-HT1e) receptor | Serotonin Receptor 1E
Type:
G Protein-Coupled Receptor (GPCR)
Mol. Mass.:
41697.80
Organism:
Homo sapiens (Human)
Description:
gi_112822
Residue:
365
  
Inhibitor
Name:
BDBM31022
Synonyms:
3-[(3,5-dimethoxybenzoyl)amino]coumarilic acid ethyl ester MLS000093010 cid_3237605 ethyl 3-[(3,5-dimethoxyphenyl)carbonylamino]-1-benzofuran-2-carboxylate
Type:
Small organic molecule
Emp. Form.:
C20H19NO6
Mol. Mass.:
369.368
SMILES:
CCOC(=O)c1oc2ccccc2c1NC(=O)c1cc(OC)cc(OC)c1
:
Substrate
Name:
Not Available
Synonyms:
Type:
Mol. Mass.:
358.43
Organism:
Description:
Residue:
3
NA