Target
Plasminogen
Ligand
BDBM31497
Substrate
BDBM31506
Meas. Tech.
TF-FVIIa Enzyme Inhibition Assay
Temperature
298.15±n/a K
IC50
60±n/a nM
Comments
extracted
Citation
 Kotian, PLKrishnan, RRowland, SEl-Kattan, YSaini, SKUpshaw, RBantia, SArnold, SBabu, YSChand, P Design, parallel synthesis, and crystal structures of biphenyl antithrombotics as selective inhibitors of tissue factor FVIIa complex. Part 1: Exploration of S2 pocket pharmacophores. Bioorg Med Chem 17:3934-58 (2009)  
Target
Name:
Plasminogen
Synonyms:
Activation peptide PLG Plasmin Plasmin heavy chain A, short form | Plasmin light chain B
Type:
Enzyme
Mol. Mass.:
90579.18
Organism:
Homo sapiens (Human)
Description:
Residue:
810
  
Inhibitor
Name:
BDBM31497
Synonyms:
substituted biphenyl derivative, 36ak
Type:
Small organic molecule
Emp. Form.:
C31H30N4O5S
Mol. Mass.:
570.659
SMILES:
CC(C)CNC(=O)c1ccc(c(c1)C(O)=O)-c1ccc(cc1C(=O)Nc1ccc(cc1)C(N)=N)-c1cscc1CO
:
Substrate
Name:
BDBM31506
Synonyms:
N-alpha-Cbz-L-lysine thiobenzyl ester hydrochloride Z-Lys-SBzl HCl
Type:
Emp. Form.:
Mol. Mass.:
SMILES:
: