Target
Dimer of Gag-Pol polyprotein [501-599]
Ligand
BDBM751
Substrate
Peptide substrate
Meas. Tech.
Protease Inhibition Assay
pH
5.5±n/a
Temperature
303.15±n/a K
IC50
0.6±n/a nM
Citation
 Smith, ABCantin, LDPasternak, AGuise-Zawacki, LYao, WCharnley, AKBarbosa, JSprengeler, PAHirschmann, RMunshi, SOlsen, DBSchleif, WAKuo, LC Design, synthesis, and biological evaluation of monopyrrolinone-based HIV-1 protease inhibitors. J Med Chem 46:1831-44 (2003)  
Target
Name:
Dimer of Gag-Pol polyprotein [501-599]
Synonyms:
HIV-1 Protease | HIV-1 Protease, recombinant, isolate HXB2
Type:
Protein Complex
Mol. Mass.:
Description:
Components:
This complex has 2 components.
Component 1
Name:
Gag-Pol polyprotein [501-599]
Synonyms:
BRU isolated HIV-1 Protease B Subtype Chain B LAI(Wild type) Protease Retropepsin | gag-pol
Type:
Enzyme Subunit
Mol. Mass.:
10795.19
Organism:
Human immunodeficiency virus type 1
Description:
P03367[501-599]
Residue:
99
  
Component 2
Name:
Gag-Pol polyprotein [501-599]
Synonyms:
BRU isolated HIV-1 Protease B Subtype Chain B LAI(Wild type) Protease Retropepsin | gag-pol
Type:
Enzyme Subunit
Mol. Mass.:
10795.19
Organism:
Human immunodeficiency virus type 1
Description:
P03367[501-599]
Residue:
99
  
Inhibitor
Name:
BDBM751
Synonyms:
CHEMBL289195 L-682,679 | tert-butyl N-[(2S,3S,5R)-5-benzyl-5-{[(1S)-1-{[(1S)-1-carbamoyl-2-phenylethyl]carbamoyl}-3-methylbutyl]carbamoyl}-3-hydroxy-1-phenylpentan-2-yl]carbamate
Type:
Small organic molecule
Emp. Form.:
C39H52N4O6
Mol. Mass.:
672.8534
SMILES:
CC(C)C[C@H](NC(=O)[C@@H](C[C@H](O)[C@H](Cc1ccccc1)NC(=O)OC(C)(C)C)Cc1ccccc1)C(=O)N[C@@H](Cc1ccccc1)C(N)=O
:
Substrate
Name:
Peptide substrate
Synonyms:
Type:
Peptide
Mol. Mass.:
755.86
Organism:
Description:
Residue:
7
VSQNPIV