Target
Dimer of Gag-Pol polyprotein [501-599]
Ligand
BDBM517
Substrate
Peptide substrate
Meas. Tech.
Protease Inhibition Assay
pH
5.5±n/a
Temperature
303.15±n/a K
IC50
0.36±n/a nM
Citation
 Smith, ABCantin, LDPasternak, AGuise-Zawacki, LYao, WCharnley, AKBarbosa, JSprengeler, PAHirschmann, RMunshi, SOlsen, DBSchleif, WAKuo, LC Design, synthesis, and biological evaluation of monopyrrolinone-based HIV-1 protease inhibitors. J Med Chem 46:1831-44 (2003)  
Target
Name:
Dimer of Gag-Pol polyprotein [501-599]
Synonyms:
HIV-1 Protease | HIV-1 Protease, recombinant, isolate HXB2
Type:
Protein Complex
Mol. Mass.:
Description:
Components:
This complex has 2 components.
Component 1
Name:
Gag-Pol polyprotein [501-599]
Synonyms:
BRU isolated HIV-1 Protease B Subtype Chain B LAI(Wild type) Protease Retropepsin | gag-pol
Type:
Enzyme Subunit
Mol. Mass.:
10795.19
Organism:
Human immunodeficiency virus type 1
Description:
P03367[501-599]
Residue:
99
  
Component 2
Name:
Gag-Pol polyprotein [501-599]
Synonyms:
BRU isolated HIV-1 Protease B Subtype Chain B LAI(Wild type) Protease Retropepsin | gag-pol
Type:
Enzyme Subunit
Mol. Mass.:
10795.19
Organism:
Human immunodeficiency virus type 1
Description:
P03367[501-599]
Residue:
99
  
Inhibitor
Name:
BDBM517
Synonyms:
(2S)-1-[(2S,4R)-4-benzyl-2-hydroxy-4-{[(1S,2R)-2-hydroxy-2,3-dihydro-1H-inden-1-yl]carbamoyl}butyl]-N-tert-butyl-4-(pyridin-3-ylmethyl)piperazine-2-carboxamide Crixivan Indinavir L-735, 524 | MK639
Type:
Small organic molecule
Emp. Form.:
C36H47N5O4
Mol. Mass.:
613.7895
SMILES:
CC(C)(C)NC(=O)[C@@H]1CN(Cc2cccnc2)CCN1C[C@@H](O)C[C@@H](Cc1ccccc1)C(=O)N[C@@H]1[C@H](O)Cc2ccccc12
:
Substrate
Name:
Peptide substrate
Synonyms:
Type:
Peptide
Mol. Mass.:
755.86
Organism:
Description:
Residue:
7
VSQNPIV