Target
cAMP and cAMP-inhibited cGMP 3',5'-cyclic phosphodiesterase 10A
Ligand
BDBM31596
Substrate
BDBM10851
Meas. Tech.
PDE Enzyme Inhibition Assay
pH
7.5±n/a
Temperature
296.15±n/a K
IC50
1.41±n/a nM
Citation
 Verhoest, PRChapin, DSCorman, MFonseca, KHarms, JFHou, XMarr, ESMenniti, FSNelson, FO'Connor, RPandit, JProulx-Lafrance, CSchmidt, AWSchmidt, CJSuiciak, JALiras, S Discovery of a Novel Class of Phosphodiesterase 10A Inhibitors and Identification of Clinical Candidate 2-[4-(1-Methyl-4-pyridin-4-yl-1H-pyrazol-3-yl)-phenoxymethyl]-quinoline (PF-2545920) for the Treatment of Schizophrenia (dagger) dagger Coordinates of the PDE10A crystal structures have been depo J Med Chem 52:5188-96 (2009)  
Target
Name:
cAMP and cAMP-inhibited cGMP 3',5'-cyclic phosphodiesterase 10A
Synonyms:
PDE10_RAT Phosphodiesterase 10 Phosphodiesterase Type 10 (PDE10A) | Rat recombinant PDE10a (rPDE10a)
Type:
Enzyme
Mol. Mass.:
90160.88
Organism:
Rattus norvegicus (rat)
Description:
PDE10A was generated from the full-length recombinant rat clone transfected into Sf9 cells.
Residue:
794
  
Inhibitor
Name:
BDBM31596
Synonyms:
substituted pyrazole, 13
Type:
Small organic molecule
Emp. Form.:
C26H19F3N4O
Mol. Mass.:
460.4505
SMILES:
FC(F)(F)Cn1cc(c(n1)-c1ccc(OCc2ccc3ccccc3n2)cc1)-c1ccncc1
:
Substrate
Name:
BDBM10851
Synonyms:
(4aR,6R,7R,7aS)-6-(6-amino-9H-purin-9-yl)-2,7-dihydroxy-hexahydro-1,3,5,2-furo[3,2-d][1,3,2]dioxaphosphinin-2-one ADENOSINE-3 ,5 -CYCLIC-MONOPHOSPHATE cAMP | cid_23902375
Type:
Small organic molecule
Emp. Form.:
C10H12N5O6P
Mol. Mass.:
329.2059
SMILES:
Nc1ncnc2n(cnc12)[C@@H]1O[C@@H]2COP(O)(=O)O[C@H]2[C@H]1O
: