Target
Heme oxygenase 1
Ligand
BDBM31772
Substrate
methemalbumin
Meas. Tech.
In Vitro HO Activity Assay
pH
7.4±n/a
Temperature
310.15±n/a K
IC50
5800±800 nM
Citation
 Kinobe, RTDercho, RAVlahakis, JZBrien, JFSzarek, WANakatsu, K Inhibition of the enzymatic activity of heme oxygenases by azole-based antifungal drugs. J Pharmacol Exp Ther 319:277-84 (2006)  
Target
Name:
Heme oxygenase 1
Synonyms:
HMOX1_RAT Heme Oxygenase 1 (HO-1) Hmox1
Type:
Enzyme
Mol. Mass.:
33005.15
Organism:
Rattus norvegicus (rat)
Description:
HO-1 obtained from rat spleen was used in enzyme assays.
Residue:
289
  
Inhibitor
Name:
BDBM31772
Synonyms:
1-[2-(2,4-dichlorobenzyl)oxy-2-(2,4-dichlorophenyl)ethyl]imidazole;nitric acid CHEMBL91 Miconazole US9144538, Miconazole Nitrate | cid_4189
Type:
Small organic molecule
Emp. Form.:
C18H14Cl4N2O
Mol. Mass.:
416.129
SMILES:
Clc1ccc(COC(Cn2ccnc2)c2ccc(Cl)cc2Cl)c(Cl)c1
:
Substrate
Name:
methemalbumin
Synonyms:
ALB heme complexed with albumin
Type:
albumin complex
Mol. Mass.:
66464.47
Organism:
Homo sapiens (Human)
Description:
Sequence of human serum albumin is shown here.
Residue:
585