Target
Heme oxygenase 2
Ligand
BDBM25817
Substrate
methemalbumin
Meas. Tech.
In Vitro HO Activity Assay
pH
7.4±n/a
Temperature
310.15±n/a K
IC50
>100000±n/a nM
Citation
 Kinobe, RTDercho, RAVlahakis, JZBrien, JFSzarek, WANakatsu, K Inhibition of the enzymatic activity of heme oxygenases by azole-based antifungal drugs. J Pharmacol Exp Ther 319:277-84 (2006)  
Target
Name:
Heme oxygenase 2
Synonyms:
HMOX2_RAT Heme oxygenase 2 | Hmox2
Type:
Enzyme
Mol. Mass.:
35754.99
Organism:
Rattus norvegicus (rat)
Description:
HO-2 obtained from rat brain was used in enzyme assays.
Residue:
315
  
Inhibitor
Name:
BDBM25817
Synonyms:
2-(2,4-difluorophenyl)-1,3-bis(1H-1,2,4-triazol-1-yl)propan-2-ol Diflucan Fluconazole (f) Triflucan US11247981, Example Fluconazole US9144538, Fluconazole US9556143, Fluconazole | cid_3365
Type:
Small organic molecule
Emp. Form.:
C13H12F2N6O
Mol. Mass.:
306.2708
SMILES:
OC(Cn1cncn1)(Cn1cncn1)c1ccc(F)cc1F
:
Substrate
Name:
methemalbumin
Synonyms:
ALB heme complexed with albumin
Type:
albumin complex
Mol. Mass.:
66464.47
Organism:
Homo sapiens (Human)
Description:
Sequence of human serum albumin is shown here.
Residue:
585