Target
Thymidylate synthase
Ligand
BDBM18796
Substrate
BDBM18754
Meas. Tech.
Thymidylate Synthase (TS) Assay
IC50
76000±n/a nM
Citation
 Gangjee, ALi, WKisliuk, RLCody, VPace, JPiraino, JMakin, J Design, synthesis, and X-ray crystal structure of classical and nonclassical 2-amino-4-oxo-5-substituted-6-ethylthieno[2,3-d]pyrimidines as dual thymidylate synthase and dihydrofolate reductase inhibitors and as potential antitumor agents. J Med Chem 52:4892-902 (2009)  
Target
Name:
Thymidylate synthase
Synonyms:
TS TYSY_ECOLI thyA
Type:
Enzyme
Mol. Mass.:
30475.81
Organism:
Escherichia coli
Description:
Residue:
264
  
Inhibitor
Name:
BDBM18796
Synonyms:
(2S)-2-{[4-(2-{2-amino-4-oxo-1H,4H,7H-pyrrolo[2,3-d]pyrimidin-5-yl}ethyl)phenyl]formamido}pentanedioic acid Pemetrexed
Type:
Small organic molecule
Emp. Form.:
C20H21N5O6
Mol. Mass.:
427.4106
SMILES:
Nc1nc2[nH]cc(CCc3ccc(cc3)C(=O)N[C@@H](CCC(O)=O)C(O)=O)c2c(=O)[nH]1
:
Substrate
Name:
BDBM18754
Synonyms:
(2S)-2-[(4-{11-amino-13-oxo-2,4,8,10,12-pentaazatricyclo[7.4.0.0^{2,6}]trideca-1(9),11-dien-4-yl}phenyl)formamido]pentanedioate 5,10-Methylenetetrahydrofolate
Type:
Small organic molecule
Emp. Form.:
C20H21N7O6
Mol. Mass.:
455.4251
SMILES:
Nc1nc2NCC3CN(CN3c2c(=O)[nH]1)c1ccc(cc1)C(=O)N[C@@H](CCC([O-])=O)C([O-])=O
: