Target
Bifunctional dihydrofolate reductase-thymidylate synthase
Ligand
BDBM31785
Substrate
BDBM18044
Meas. Tech.
Thymidylate Synthase (TS) Assay
IC50
17±n/a nM
Citation
 Gangjee, ALi, WKisliuk, RLCody, VPace, JPiraino, JMakin, J Design, synthesis, and X-ray crystal structure of classical and nonclassical 2-amino-4-oxo-5-substituted-6-ethylthieno[2,3-d]pyrimidines as dual thymidylate synthase and dihydrofolate reductase inhibitors and as potential antitumor agents. J Med Chem 52:4892-902 (2009)  
Target
Name:
Bifunctional dihydrofolate reductase-thymidylate synthase
Synonyms:
DHFR-TS Dihydrofolate reductase Dihydrofolate reductase; T. gondii vs rat
Type:
Enzyme
Mol. Mass.:
68757.49
Organism:
Toxoplasma gondii
Description:
Q07422
Residue:
610
  
Inhibitor
Name:
BDBM31785
Synonyms:
thieno[2,3-d]pyrimidine deriv., 2h
Type:
Small organic molecule
Emp. Form.:
C13H12N4OS2
Mol. Mass.:
304.391
SMILES:
CCc1sc2nc(N)[nH]c(=O)c2c1Sc1ccncc1
:
Substrate
Name:
BDBM18044
Synonyms:
(2S)-2-[(4-{[(2-amino-4-oxo-1,4,7,8-tetrahydropteridin-6-yl)methyl]amino}phenyl)formamido]pentanedioic acid dihydrofolic acid
Type:
Small organic molecule
Emp. Form.:
C19H21N7O6
Mol. Mass.:
443.4133
SMILES:
Nc1nc2NCC(CNc3ccc(cc3)C(=O)N[C@@H](CCC(O)=O)C(O)=O)=Nc2c(=O)[nH]1
: