Target
Mast/stem cell growth factor receptor Kit
Ligand
BDBM397910
Substrate
Meas. Tech.
Biochemical Activity Assay
IC50
<1±n/a nM
Citation
 DiPietro, LVHodous, BLKim, JLMiduturu, CVWenglowsky, SMWilson, DZhang, Y Compositions useful for treating disorders related to kit US Patent  US9994552 Publication Date 6/12/2018 
Target
Name:
Mast/stem cell growth factor receptor Kit
Synonyms:
CD117 antigen KIT Mast/stem cell growth factor receptor Kit (cKIT) Proto-oncogene tyrosine-protein kinase Kit Stem cell growth factor receptor Tyrosine-protein kinase Kit c-kit v-kit Hardy-Zuckerman 4 feline sarcoma viral oncogene homolog
Type:
Protein
Mol. Mass.:
109869.37
Organism:
Homo sapiens (Human)
Description:
P10721
Residue:
976
  
Inhibitor
Name:
BDBM397910
Synonyms:
US9994552, Compound 121
Type:
Small organic molecule
Emp. Form.:
C31H35N7O3
Mol. Mass.:
553.6547
SMILES:
COc1cc2ncnc(N3CC4CCC(C3)N4c3ncc(Cc4ccccc4)cn3)c2cc1OCC1CNCCO1
: