Target
Bcl-2-like protein 1
Ligand
BDBM31806
Substrate
Bak-BH3 peptide
Meas. Tech.
Fluorescence Polarization Assay
pH
7.4±n/a
Temperature
296.15±n/a K
IC50
6300±n/a nM
Citation
 Wei, JKitada, SRega, MFStebbins, JLZhai, DCellitti, JYuan, HEmdadi, ADahl, RZhang, ZYang, LReed, JCPellecchia, M Apogossypol derivatives as pan-active inhibitors of antiapoptotic B-cell lymphoma/leukemia-2 (Bcl-2) family proteins. J Med Chem 52:4511-23 (2009)  
Target
Name:
Bcl-2-like protein 1
Synonyms:
Anti-apoptotic Bcl-2 protein Apoptosis regulator Bcl-X BCL2-like 1 isoform 1 BCL2L1 Bcl-2-like protein 1 (Bcl-XL) Bcl-xL/Bcl-2-binding component 3 Bcl2-antagonist of cell death (BAD)
Type:
Mitochondrion membrane; Single-pass membrane protein
Mol. Mass.:
26039.60
Organism:
Homo sapiens (Human)
Description:
Residue:
233
  
Inhibitor
Name:
BDBM31806
Synonyms:
Apogossypol derivative, 8p
Type:
Small organic molecule
Emp. Form.:
C40H34Cl2N2O8
Mol. Mass.:
741.613
SMILES:
Cc1cc2c(C(=O)NCCc3cccc(Cl)c3)c(O)c(O)cc2c(O)c1-c1c(C)cc2c(C(=O)NCCc3cccc(Cl)c3)c(O)c(O)cc2c1O
:
Substrate
Name:
Bak-BH3 peptide
Synonyms:
F-BakBH3
Type:
Fluorescein-labeled peptide
Mol. Mass.:
1724.92
Organism:
Description:
Derived from human apoptosis regulator BAK (residues 72-87).
Residue:
16
GQVGRQLAIIGDDINR