Target
Induced myeloid leukemia cell differentiation protein Mcl-1
Ligand
BDBM31807
Substrate
FITC-conjugated-Bim BH3 Peptide
Meas. Tech.
Fluorescence Polarization Assay
pH
7.4±n/a
Temperature
296.15±n/a K
IC50
590±n/a nM
Citation
 Wei, JKitada, SRega, MFStebbins, JLZhai, DCellitti, JYuan, HEmdadi, ADahl, RZhang, ZYang, LReed, JCPellecchia, M Apogossypol derivatives as pan-active inhibitors of antiapoptotic B-cell lymphoma/leukemia-2 (Bcl-2) family proteins. J Med Chem 52:4511-23 (2009)  
Target
Name:
Induced myeloid leukemia cell differentiation protein Mcl-1
Synonyms:
BCL2L3 Bcl-2-like protein 3 (Mcl-1) Bcl2-L-3 MCL1 Mcl-1 Myeloid cell leukemia sequence 1 (BCL2-related) | mcl1/EAT
Type:
Membrane; Single-pass membrane protein
Mol. Mass.:
37332.87
Organism:
Homo sapiens (Human)
Description:
Q07820
Residue:
350
  
Inhibitor
Name:
BDBM31807
Synonyms:
Apogossypol derivative, 8q
Type:
Small organic molecule
Emp. Form.:
C44H44N2O8
Mol. Mass.:
728.8288
SMILES:
CCc1ccc(CCNC(=O)c2c(O)c(O)cc3c(O)c(c(C)cc23)-c2c(C)cc3c(C(=O)NCCc4ccc(CC)cc4)c(O)c(O)cc3c2O)cc1
:
Substrate
Name:
FITC-conjugated-Bim BH3 Peptide
Synonyms:
FITC-Ahx-DMRPEIWIAQELRRIGDEFNAYYAR-OH
Type:
FITC-labeled Peptide
Mol. Mass.:
3112.46
Organism:
Description:
Residue:
25