Target
Dimer of Gag-Pol polyprotein [489-587]
Ligand
BDBM760
Substrate
Peptide substrate
Meas. Tech.
Protease Inhibition Assay
pH
5.5±n/a
Temperature
303.15±n/a K
IC50
0.15±n/a nM
Citation
 Vacca, JPGuare, JPdeSolms, SJSanders, WMGiuliani, EAYoung, SDDarke, PLZugay, JSigal, ISSchleif, WA L-687,908, a potent hydroxyethylene-containing HIV protease inhibitor. J Med Chem 34:1225-8 (1991)  
Target
Name:
Dimer of Gag-Pol polyprotein [489-587]
Synonyms:
HIV-1 Protease
Type:
Protein Complex
Mol. Mass.:
Description:
Components:
This complex has 2 components.
Component 1
Name:
Gag-Pol polyprotein [489-587]
Synonyms:
HIV protease HIV-1 Protease chain A POL_HV1N5 | gag-pol
Type:
Enzyme Subunit
Mol. Mass.:
10822.21
Organism:
Human immunodeficiency virus type 1
Description:
P12497[489-587]
Residue:
99
  
Component 2
Name:
Gag-Pol polyprotein [489-587]
Synonyms:
HIV protease HIV-1 Protease chain A POL_HV1N5 | gag-pol
Type:
Enzyme Subunit
Mol. Mass.:
10822.21
Organism:
Human immunodeficiency virus type 1
Description:
P12497[489-587]
Residue:
99
  
Inhibitor
Name:
BDBM760
Synonyms:
Hydroxyethylene deriv. 11 | tert-butyl N-[(2S,3S,5R)-5-benzyl-5-({1-[(2,3-dihydroxypropyl)carbamoyl]-2-methylbutyl}carbamoyl)-3-hydroxy-1-phenylpentan-2-yl]carbamate
Type:
Small organic molecule
Emp. Form.:
C33H49N3O7
Mol. Mass.:
599.7581
SMILES:
CCC(C)C(NC(=O)[C@@H](C[C@H](O)[C@H](Cc1ccccc1)NC(=O)OC(C)(C)C)Cc1ccccc1)C(=O)NCC(O)CO
:
Substrate
Name:
Peptide substrate
Synonyms:
Type:
Peptide
Mol. Mass.:
755.86
Organism:
Description:
Residue:
7
VSQNPIV