Target
Epidermal growth factor receptor [668-1210]
Ligand
BDBM5446
Substrate
Tyr 04 Substrate Peptide
Meas. Tech.
EGFR IC50 Determination
pH
7.5±n/a
Temperature
296.15±n/a K
IC50
3.6±n/a nM
Citation
 Michalczyk, AKlüter, SRode, HBSimard, JRGrütter, CRabiller, MRauh, D Structural insights into how irreversible inhibitors can overcome drug resistance in EGFR. Bioorg Med Chem 16:3482-8 (2008)  
Target
Name:
Epidermal growth factor receptor [668-1210]
Synonyms:
EGF-R Tyrosine Kinase EGFR_HUMAN ERBB1 HER1 | Receptor tyrosine-protein kinase ErbB-1
Type:
Cytoplasmic region
Mol. Mass.:
61304.06
Organism:
Homo sapiens (Human)
Description:
Wildtype EGFR was purchased from Invitrogen.
Residue:
543
  
Inhibitor
Name:
BDBM5446
Synonyms:
CHEMBL553 Erlotinib N-(3-Ethynylphenyl)-6,7-bis(2-methoxyethoxy)-4-quinazolinamine Monohydrochloride OSI-774 US10189853, erlotinib US11524945, Compound Erlotinib US9730934, Erlotinib cid_176870
Type:
Small organic molecule
Emp. Form.:
C22H23N3O4
Mol. Mass.:
393.4357
SMILES:
COCCOc1cc2ncnc(Nc3cccc(c3)C#C)c2cc1OCCOC
:
Substrate
Name:
Tyr 04 Substrate Peptide
Synonyms:
Type:
FRET-peptide substrate
Mol. Mass.:
358.43
Organism:
Description:
Residue:
3
NA