Target
Cathepsin L2
Ligand
BDBM31983
Substrate
BDBM22047
Meas. Tech.
Cathepsin Inhibition Assay
IC50
3162±n/a nM
Citation
 Asaad, NBethel, PACoulson, MDDawson, JEFord, SJGerhardt, SGrist, MHamlin, GAJames, MJJones, EVKaroutchi, GIKenny, PWMorley, ADOldham, KRankine, NRyan, DWells, SLWood, LAugustin, MKrapp, SSimader, HSteinbacher, S Dipeptidyl nitrile inhibitors of Cathepsin L. Bioorg Med Chem Lett 19:4280-3 (2009)  
Target
Name:
Cathepsin L2
Synonyms:
CATL2 CTSL2 CTSV Cathepsin V
Type:
Enzyme
Mol. Mass.:
37341.06
Organism:
Homo sapiens (Human)
Description:
O60911
Residue:
334
  
Inhibitor
Name:
BDBM31983
Synonyms:
Dipeptidyl nitrile inhibitor, 16
Type:
Small organic molecule
Emp. Form.:
C21H17ClN4O2
Mol. Mass.:
392.838
SMILES:
Clc1cccc(C[C@H](NC(=O)c2ccnc3ccccc23)C(=O)NCC#N)c1
:
Substrate
Name:
BDBM22047
Synonyms:
CBZ-Phe-Arg 7-amido-4-methylcoumarin | Z-Phe-Arg-AMC
Type:
Fluorogenic substrate
Emp. Form.:
C33H36N6O6
Mol. Mass.:
612.6755
SMILES:
[#6]-c1cc(=O)oc2cc(-[#7]-[#6](=O)-[#6](-[#6]-[#6]-[#6]\[#7]=[#6](\[#7])-[#7])-[#7]-[#6](=O)-[#6](-[#6]-c3ccccc3)-[#7]-[#6](=O)-[#8]-[#6]-c3ccccc3)ccc12
: