Target
Cathepsin K
Ligand
BDBM31980
Substrate
BDBM22047
Meas. Tech.
Cathepsin Inhibition Assay
IC50
5012±n/a nM
Citation
 Asaad, NBethel, PACoulson, MDDawson, JEFord, SJGerhardt, SGrist, MHamlin, GAJames, MJJones, EVKaroutchi, GIKenny, PWMorley, ADOldham, KRankine, NRyan, DWells, SLWood, LAugustin, MKrapp, SSimader, HSteinbacher, S Dipeptidyl nitrile inhibitors of Cathepsin L. Bioorg Med Chem Lett 19:4280-3 (2009)  
Target
Name:
Cathepsin K
Synonyms:
CATK_HUMAN CTSO Cathepsin O Cathepsin X
Type:
Enzyme
Mol. Mass.:
36975.68
Organism:
Homo sapiens (Human)
Description:
P43235
Residue:
329
  
Inhibitor
Name:
BDBM31980
Synonyms:
Dipeptidyl nitrile inhibitor, 13
Type:
Small organic molecule
Emp. Form.:
C20H20ClN3O2
Mol. Mass.:
369.845
SMILES:
Cc1cc(C)cc(c1)C(=O)N[C@@H](Cc1cccc(Cl)c1)C(=O)NCC#N
:
Substrate
Name:
BDBM22047
Synonyms:
CBZ-Phe-Arg 7-amido-4-methylcoumarin | Z-Phe-Arg-AMC
Type:
Fluorogenic substrate
Emp. Form.:
C33H36N6O6
Mol. Mass.:
612.6755
SMILES:
[#6]-c1cc(=O)oc2cc(-[#7]-[#6](=O)-[#6](-[#6]-[#6]-[#6]\[#7]=[#6](\[#7])-[#7])-[#7]-[#6](=O)-[#6](-[#6]-c3ccccc3)-[#7]-[#6](=O)-[#8]-[#6]-c3ccccc3)ccc12
: