Target
Heat shock protein HSP 90-alpha
Ligand
BDBM31997
Substrate
cy3B-GM
Meas. Tech.
Tumor Hsp90 Inhibitors Dose Response Confirmation
pH
7.4±n/a
Temperature
296.15±n/a K
IC50
8363.1±n/a nM
Citation
 PubChem, PC Tumor Hsp90 Inhibitors Dose Response Confirmation PubChem Bioassay (2007)[AID] 
Target
Name:
Heat shock protein HSP 90-alpha
Synonyms:
HS90A_HUMAN HSP86 HSP90AA1 HSPCA Heat shock 86 kDa Heat shock protein HSP 90-alpha (HSP90) LAP-2 Lipopolysaccharide-associated protein 2 heat shock protein 90kDa alpha (cytosolic), class A member 1 isoform 2
Type:
Molecular Chaperone
Mol. Mass.:
84623.45
Organism:
Homo sapiens (Human)
Description:
P07900
Residue:
732
  
Inhibitor
Name:
BDBM31997
Synonyms:
6-Methoxy-3-methyl-1H-benzo[de]cinnoline SMR000010302 | cid_644992
Type:
Small organic molecule
Emp. Form.:
C13H12N2O
Mol. Mass.:
212.2472
SMILES:
COc1ccc2c(C)n[nH]c3cccc1c23
:
Substrate
Name:
cy3B-GM
Synonyms:
fluorescently (Cy3B) labeled geldanamycin
Type:
fluorescent probe
Mol. Mass.:
358.43
Organism:
Description:
Residue:
3
NA