Target
Isoform Bcl-X(L) of Bcl-2-like protein 1 (Bcl-xL)
Ligand
BDBM32285
Substrate
F-Bim
Meas. Tech.
Multiplexed dose response screen for small molecule regulators of Bcl-2 family protein interactions, specifically Bim-Bcl-XL.
pH
7.4±n/a
Temperature
277.15±n/a K
EC50
2430±n/a nM
Citation
 PubChem, PC Multiplexed dose response screen for small molecule regulators of Bcl-2 family protein interactions, specifically Bim-Bcl-XL. PubChem Bioassay (2008)[AID] 
Target
Name:
Isoform Bcl-X(L) of Bcl-2-like protein 1 (Bcl-xL)
Synonyms:
B-cell lymphoma-extra large protein (Bcl-xL) BCL-xL BCL2L1 Bcl-2-like protein 1 (Bcl-xL) | Isoform Bcl-X(L)
Type:
Homodimers/heterodimers with BAX, BAK and BCL2
Mol. Mass.:
26053.63
Organism:
Homo sapiens (Human)
Description:
gi_510901
Residue:
233
  
Inhibitor
Name:
BDBM32285
Synonyms:
(4E)-2-methoxy-4-[([1,2,4]triazolo[3,4-a]phthalazin-6-ylhydrazo)methylidene]-1-cyclohexa-2,5-dienone (4E)-2-methoxy-4-[[N'-([1,2,4]triazolo[3,4-a]phthalazin-6-yl)hydrazino]methylene]cyclohexa-2,5-dien-1-one SMR000131930 | cid_11957199
Type:
Small organic molecule
Emp. Form.:
C17H14N6O2
Mol. Mass.:
334.3321
SMILES:
COc1cc(CN=Nc2nn3cnnc3c3ccccc23)ccc1O
:
Substrate
Name:
F-Bim
Synonyms:
Type:
fluorescent peptide probe
Mol. Mass.:
3923.40
Organism:
Description:
Residue:
32