Target
Biotin carboxylase
Ligand
BDBM32643
Substrate
Biotinyl-BCCP
Meas. Tech.
ACCase-Coupled Enzyme Assay
pH
8±n/a
Temperature
296.15±n/a K
IC50
60800±n/a nM
Citation
 Mochalkin, IMiller, JRNarasimhan, LThanabal, VErdman, PCox, PBPrasad, JVLightle, SHuband, MDStover, CK Discovery of antibacterial biotin carboxylase inhibitors by virtual screening and fragment-based approaches. ACS Chem Biol 4:473-83 (2009)  
Target
Name:
Biotin carboxylase
Synonyms:
ACC Acetyl-CoA carboxylase subunit A fabG
Type:
A component of the acetyl coenzyme A carboxylase complex
Mol. Mass.:
49324.23
Organism:
Escherichia coli (strain K12)
Description:
The accC gene was amplified by PCR from E. coli genomic DNA. The recombinant protein was expressed and purified from E. coli.
Residue:
449
  
Inhibitor
Name:
BDBM32643
Synonyms:
amino pyrimidine ketone, 3
Type:
Small organic molecule
Emp. Form.:
C10H13N3O
Mol. Mass.:
191.2297
SMILES:
CC1(C)CC(=O)c2c(N)ncnc2C1
:
Substrate
Name:
Biotinyl-BCCP
Synonyms:
BCCP_ECOLI accB | fabE
Type:
biotin binding protein
Mol. Mass.:
16678.47
Organism:
Escherichia coli (strain K12)
Description:
Residue:
156