Target
Bcl-2-related protein A1
Ligand
BDBM33044
Substrate
FITC-conjugated-Bim BH3 Peptide
Meas. Tech.
Multiplexed dose response screen for small molecule regulators of Bcl-2 family protein interactions, specifically Bim-Bfl-1.
pH
7.4±n/a
Temperature
277.15±n/a K
EC50
28550±n/a nM
Citation
 PubChem, PC Multiplexed dose response screen for small molecule regulators of Bcl-2 family protein interactions, specifically Bim-Bfl-1. PubChem Bioassay (2008)[AID] 
Target
Name:
Bcl-2-related protein A1
Synonyms:
B2LA1_HUMAN BCL2L5 Bcl-2-like protein 5 HBPA1 Protein BFL-1 | Protein GRS
Type:
Apoptosis regulator protein
Mol. Mass.:
20130.01
Organism:
Homo sapiens (Human)
Description:
Residue:
175
  
Inhibitor
Name:
BDBM33044
Synonyms:
MLS000082988 SMR000046885 diethyl-[4-[3-(1,4,5,6-tetrahydrocyclopenta[c]pyrazol-3-yl)-[1,2,4]triazolo[3,4-b][1,3,4]thiadiazol-6-yl]phenyl]amine
Type:
Small organic molecule
Emp. Form.:
C19H21N7S
Mol. Mass.:
379.482
SMILES:
CCN(CC)c1ccc(cc1)-c1nn2c(nnc2s1)-c1n[nH]c2CCCc12
:
Substrate
Name:
FITC-conjugated-Bim BH3 Peptide
Synonyms:
FITC-Ahx-DMRPEIWIAQELRRIGDEFNAYYAR-OH
Type:
FITC-labeled Peptide
Mol. Mass.:
3112.46
Organism:
Description:
Residue:
25