Target
Bcl-2-related protein A1
Ligand
BDBM33046
Substrate
FITC-conjugated-Bim BH3 Peptide
Meas. Tech.
Multiplexed dose response screen for small molecule regulators of Bcl-2 family protein interactions, specifically Bim-Bfl-1.
pH
7.4±n/a
Temperature
277.15±n/a K
EC50
4190±n/a nM
Citation
 PubChem, PC Multiplexed dose response screen for small molecule regulators of Bcl-2 family protein interactions, specifically Bim-Bfl-1. PubChem Bioassay (2008)[AID] 
Target
Name:
Bcl-2-related protein A1
Synonyms:
B2LA1_HUMAN BCL2L5 Bcl-2-like protein 5 HBPA1 Protein BFL-1 | Protein GRS
Type:
Apoptosis regulator protein
Mol. Mass.:
20130.01
Organism:
Homo sapiens (Human)
Description:
Residue:
175
  
Inhibitor
Name:
BDBM33046
Synonyms:
2-[(5-amino-1H-1,2,4-triazol-3-yl)sulfanyl]-N-[3-cyano-7,7-dimethyl-5-[(E)-2-(5-methylfuran-2-yl)ethenyl]-6H-1-benzothiophen-2-yl]acetamide 2-[(5-amino-1H-1,2,4-triazol-3-yl)thio]-N-[3-cyano-7,7-dimethyl-5-[(E)-2-(5-methyl-2-furyl)vinyl]-6H-benzothiophen-2-yl]acetamide MLS000097571 cid_2079240
Type:
Small organic molecule
Emp. Form.:
C22H22N6O2S2
Mol. Mass.:
466.579
SMILES:
Cc1ccc(\C=C\C2=Cc3c(sc(NC(=O)CSc4nnc(N)[nH]4)c3C#N)C(C)(C)C2)o1
:
Substrate
Name:
FITC-conjugated-Bim BH3 Peptide
Synonyms:
FITC-Ahx-DMRPEIWIAQELRRIGDEFNAYYAR-OH
Type:
FITC-labeled Peptide
Mol. Mass.:
3112.46
Organism:
Description:
Residue:
25