Target
Bcl-2-related protein A1
Ligand
BDBM33048
Substrate
FITC-conjugated-Bim BH3 Peptide
Meas. Tech.
Multiplexed dose response screen for small molecule regulators of Bcl-2 family protein interactions, specifically Bim-Bfl-1.
pH
7.4±n/a
Temperature
277.15±n/a K
EC50
890±n/a nM
Citation
 PubChem, PC Multiplexed dose response screen for small molecule regulators of Bcl-2 family protein interactions, specifically Bim-Bfl-1. PubChem Bioassay (2008)[AID] 
Target
Name:
Bcl-2-related protein A1
Synonyms:
B2LA1_HUMAN BCL2L5 Bcl-2-like protein 5 HBPA1 Protein BFL-1 | Protein GRS
Type:
Apoptosis regulator protein
Mol. Mass.:
20130.01
Organism:
Homo sapiens (Human)
Description:
Residue:
175
  
Inhibitor
Name:
BDBM33048
Synonyms:
(5Z)-5-{[4-(dimethylamino)phenyl]imino}-1-(3-hydroxypropyl)-4-methyl-2,6-dioxo-1,2,5,6-tetrahydropyridine-3-carbonitrile 5-[4-(dimethylamino)phenyl]imino-1-(3-hydroxypropyl)-4-methyl-2,6-dioxo-3-pyridinecarbonitrile 5-[4-(dimethylamino)phenyl]imino-4-methyl-2,6-bis(oxidanylidene)-1-(3-oxidanylpropyl)pyridine-3-carbonitrile SMR000024616 | cid_3239318
Type:
Small organic molecule
Emp. Form.:
C18H20N4O3
Mol. Mass.:
340.3764
SMILES:
CN(C)c1ccc(cc1)\N=C1/C(C)=C(C#N)C(=O)N(CCCO)C1=O
:
Substrate
Name:
FITC-conjugated-Bim BH3 Peptide
Synonyms:
FITC-Ahx-DMRPEIWIAQELRRIGDEFNAYYAR-OH
Type:
FITC-labeled Peptide
Mol. Mass.:
3112.46
Organism:
Description:
Residue:
25