Target
Dimer of Gag-Pol polyprotein [489-587]
Ligand
BDBM786
Substrate
Peptide Substrate
Meas. Tech.
Protease Inhibition Assay
pH
5±n/a
Temperature
295.15±n/a K
Ki
62±n/a nM
Comments
Determination of Ki values with this assay requires analysis under conditions in which substrate concentration resides substantially below Km and the inhibitor concentrations greatly exceeds the Ki value and the enzyme concentration.
Citation
 Romines, KRWatenpaugh, KDTomich, PKHowe, WJMorris, JKLovasz, KDMulichak, AMFinzel, BCLynn, JCHorng, MM Use of medium-sized cycloalkyl rings to enhance secondary binding: discovery of a new class of human immunodeficiency virus (HIV) protease inhibitors. J Med Chem 38:1884-91 (1995)  
Target
Name:
Dimer of Gag-Pol polyprotein [489-587]
Synonyms:
HIV-1 Protease
Type:
Protein Complex
Mol. Mass.:
Description:
Components:
This complex has 2 components.
Component 1
Name:
Gag-Pol polyprotein [489-587]
Synonyms:
HIV protease HIV-1 Protease chain A POL_HV1N5 | gag-pol
Type:
Enzyme Subunit
Mol. Mass.:
10822.21
Organism:
Human immunodeficiency virus type 1
Description:
P12497[489-587]
Residue:
99
  
Component 2
Name:
Gag-Pol polyprotein [489-587]
Synonyms:
HIV protease HIV-1 Protease chain A POL_HV1N5 | gag-pol
Type:
Enzyme Subunit
Mol. Mass.:
10822.21
Organism:
Human immunodeficiency virus type 1
Description:
P12497[489-587]
Residue:
99
  
Inhibitor
Name:
BDBM786
Synonyms:
4-hydroxy-3-(1-phenylpentyl)-2H,5H,6H,7H,8H,9H,10H-cycloocta[b]pyran-2-one Cyclooctylpyranone 9
Type:
Small organic molecule
Emp. Form.:
C22H28O3
Mol. Mass.:
340.4559
SMILES:
CCCCC(c1ccccc1)c1c(O)c2CCCCCCc2oc1=O
:
Substrate
Name:
Peptide Substrate
Synonyms:
Type:
Peptide
Mol. Mass.:
1447.64
Organism:
Description:
The peptide was derivatized with biotin and fluorescein isothiocyanate at the amino and carboxy termini.
Residue:
12
RVSQNYPIVQNK