Target
Prothrombin
Ligand
BDBM33783
Substrate
Boc-Val-Pro-Arg-AMC
Meas. Tech.
Thrombin 1536 HTS Dose Response Confirmation
pH
7.5±n/a
Temperature
296.15±n/a K
IC50
>50000±n/a nM
Citation
 PubChem, PC Thrombin 1536 HTS Dose Response Confirmation PubChem Bioassay (2008)[AID] 
Target
Name:
Prothrombin
Synonyms:
Activation peptide fragment 1 Coagulation factor II Prothrombin precursor Thrombin heavy chain | Thrombin light chain
Type:
Protein
Mol. Mass.:
70029.57
Organism:
Homo sapiens (Human)
Description:
P00734
Residue:
622
  
Inhibitor
Name:
BDBM33783
Synonyms:
1-[(1-ethyl-2-methyl-benzimidazol-5-yl)carbonylamino]-3-(4-methylphenyl)thiourea 1-[(1-ethyl-2-methylbenzimidazole-5-carbonyl)amino]-3-(4-methylphenyl)thiourea MLS000402364 cid_2328617
Type:
Small organic molecule
Emp. Form.:
C19H21N5OS
Mol. Mass.:
367.468
SMILES:
CCn1c(C)nc2cc(ccc12)C(=O)NNC(=S)Nc1ccc(C)cc1
:
Substrate
Name:
Boc-Val-Pro-Arg-AMC
Synonyms:
Type:
fluorogenic substrate
Mol. Mass.:
358.43
Organism:
Description:
Residue:
3
NA