Target
Cathepsin S
Ligand
BDBM33988
Substrate
Cathepsin S Substrate Peptide
Meas. Tech.
Cathepsn S Inhibition Assay
pH
5±n/a
Temperature
296.15±n/a K
IC50
280±n/a nM
Citation
 Ameriks, MKAxe, FUBembenek, SDEdwards, JPGu, YKarlsson, LRandal, MSun, SThurmond, RLZhu, J Pyrazole-based cathepsin S inhibitors with arylalkynes as P1 binding elements. Bioorg Med Chem Lett 19:6131-4 (2009)  
Target
Name:
Cathepsin S
Synonyms:
CATS_HUMAN Cathepsin S (Cat S) | cathepsin S preproprotein
Type:
Protein
Mol. Mass.:
37507.38
Organism:
Homo sapiens (Human)
Description:
P25774
Residue:
331
  
Inhibitor
Name:
BDBM33988
Synonyms:
arylalkyne pyrazole-based compound, 19
Type:
Small organic molecule
Emp. Form.:
C29H33ClN4O3S
Mol. Mass.:
553.115
SMILES:
Cc1ccc(cc1)C#Cc1cc(ccc1Cl)-c1nn(CCCN2CCOCC2)c2CCN(Cc12)S(C)(=O)=O
:
Substrate
Name:
Cathepsin S Substrate Peptide
Synonyms:
Type:
Internally quenched FRET peptide
Mol. Mass.:
2951.18
Organism:
Description:
Residue:
27