Target
Tyrosine-protein kinase JAK2 [828-1132]
Ligand
BDBM246868
Substrate
Meas. Tech.
In Vitro JAK Kinase Assay
IC50
25±n/a nM
Citation
 Huang, TXue, C Piperidin-4-yl azetidine derivatives as JAK1 inhibitors US Patent  US9999619 Publication Date 6/19/2018 
Target
Name:
Tyrosine-protein kinase JAK2 [828-1132]
Synonyms:
JAK2 JAK2_HUMAN | Tyrosine-protein kinase JAK2
Type:
Mol. Mass.:
35579.28
Organism:
Homo sapiens (Human)
Description:
O60674[828-1132]
Residue:
305
  
Inhibitor
Name:
BDBM246868
Synonyms:
US10053465, 7 US10125150, Example 7 US10479803, Example 7 US10675284, Example 7 US11084822, Example 7 US11136326, Example 7 US11304949, Compound 1 US11406640, Comp. No. 1 US20240058343, Compound 1 US9999619, Example 364 | {1-{1-[3-Fluoro-2- (trifluoromethyl) isonicotinoyl] piperidin-4- yl}-3-[4-(7H- pyrrolo[2,3- d]pyrimidin-4-yl)- 1H-pyrazol-1- yl]azetidin-3- yl}acetonitrile
Type:
Small organic molecule
Emp. Form.:
C26H23F4N9O
Mol. Mass.:
553.5141
SMILES:
Fc1c(ccnc1C(F)(F)F)C(=O)N1CCC(CC1)N1CC(CC#N)(C1)n1cc(cn1)-c1ncnc2[nH]ccc12
: