Target
Dimer of Gag-Pol polyprotein [489-587,Q496K,I573V]
Ligand
BDBM519
Substrate
fluorogenic peptide substrate, SQNY/PIVQ
Meas. Tech.
Protease Inhibition Assay
pH
5±n/a
Temperature
298.15±n/a K
Ki
2.0±0.6 nM
Km
24650±1930 nM
kcat
1.31±0.04 1/sec
Citation
 Muzammil, SMuzammil, SRoss, PRoss, PFreire, EFreire, E A major role for a set of non-active site mutations in the development of HIV-1 protease drug resistance. Biochemistry 42:631-8 (2003)  
Target
Name:
Dimer of Gag-Pol polyprotein [489-587,Q496K,I573V]
Synonyms:
HIV-1 Protease Mutant, A-1
Type:
Protein Complex
Mol. Mass.:
Description:
Components:
This complex has 2 components.
Component 1
Name:
Gag-Pol polyprotein [489-587,Q496K,I573V]
Synonyms:
HIV-1 Protease Mutant(Q7K/I84V) HIV-1 Protease Mutant, A-1 chain B gag-pol
Type:
Enzyme Subunit
Mol. Mass.:
10768.18
Organism:
Human immunodeficiency virus type 1
Description:
All of the protease constructs in this study are on the wild type containing the single Q7K mutation to prevent autocatalysis.This protein has enzymatic properties similar to that of the wild type protease.
Residue:
99
  
Component 2
Name:
Gag-Pol polyprotein [489-587,Q496K,I573V]
Synonyms:
HIV-1 Protease Mutant(Q7K/I84V) HIV-1 Protease Mutant, A-1 chain B gag-pol
Type:
Enzyme Subunit
Mol. Mass.:
10768.18
Organism:
Human immunodeficiency virus type 1
Description:
All of the protease constructs in this study are on the wild type containing the single Q7K mutation to prevent autocatalysis.This protein has enzymatic properties similar to that of the wild type protease.
Residue:
99
  
Inhibitor
Name:
BDBM519
Synonyms:
(2S)-N-[(2S,3R)-4-[(3S,4aS,8aS)-3-(tert-butylcarbamoyl)-decahydroisoquinolin-2-yl]-3-hydroxy-1-phenylbutan-2-yl]-2-(quinolin-2-ylformamido)butanediamide Fortovase Ro 31-8959 Saquinavir
Type:
Small organic molecule
Emp. Form.:
C38H50N6O5
Mol. Mass.:
670.8408
SMILES:
CC(C)(C)NC(=O)[C@@H]1C[C@@H]2CCCC[C@@H]2CN1C[C@@H](O)[C@H](Cc1ccccc1)NC(=O)[C@H](CC(N)=O)NC(=O)c1ccc2ccccc2n1
:
Substrate
Name:
fluorogenic peptide substrate, SQNY/PIVQ
Synonyms:
Type:
Peptide
Mol. Mass.:
4728.18
Organism:
Description:
Residue:
44