Target
Mannose-6-phosphate isomerase
Ligand
BDBM34740
Substrate
Mannose-6-phosphate
Meas. Tech.
HTS identification of compounds inhibiting phosphomannose isomerase (PMI) via a fluorescence intensity assay using a high concentration of mannose 6-phosphate
pH
7.4±n/a
Temperature
296.15±n/a K
IC50
14400±0 nM
Citation
 PubChem, PC HTS identification of compounds inhibiting phosphomannose isomerase (PMI) via a fluorescence intensity assay using a high concentration of mannose 6-phosphate PubChem Bioassay (2009)[AID] 
Target
Name:
Mannose-6-phosphate isomerase
Synonyms:
MPI MPI_HUMAN PMI1
Type:
PROTEIN
Mol. Mass.:
46651.35
Organism:
Homo sapiens (Human)
Description:
ChEMBL_1448919
Residue:
423
  
Inhibitor
Name:
BDBM34740
Synonyms:
4-Phenyl-naphthalen-2-ol 4-phenyl-2-naphthol MLS000591683 cid_1833740
Type:
Small organic molecule
Emp. Form.:
C16H12O
Mol. Mass.:
220.2659
SMILES:
Oc1cc(-c2ccccc2)c2ccccc2c1
:
Substrate
Name:
Mannose-6-phosphate
Synonyms:
Type:
Mol. Mass.:
358.43
Organism:
Description:
Residue:
3
NA