Target
Cathepsin B
Ligand
BDBM32766
Substrate
Z-Arg-Arg-AMC
Meas. Tech.
Cathepsin B mixture HTS dose-response confirmation
pH
6.8±n/a
Temperature
296.15±n/a K
IC50
11012.2±n/a nM
Citation
 PubChem, PC Cathepsin B mixture HTS dose-response confirmation  PubChem Bioassay (2008)[AID] 
Target
Name:
Cathepsin B
Synonyms:
APP secretase CATB_HUMAN CTSB Cathepsin B light chain | Cathepsin B1
Type:
Enzyme
Mol. Mass.:
37819.69
Organism:
Homo sapiens (Human)
Description:
gi_63102437
Residue:
339
  
Inhibitor
Name:
BDBM32766
Synonyms:
MLS000027597 [4-[(2-methoxyphenyl)iminomethyl]-2-phenyl-1,3-oxazol-5-yl] acetate acetic acid [4-[(2-methoxyphenyl)iminomethyl]-2-phenyl-5-oxazolyl] ester cid_658724
Type:
Small organic molecule
Emp. Form.:
C19H16N2O4
Mol. Mass.:
336.3413
SMILES:
COc1ccccc1\N=C\c1nc(oc1OC(C)=O)-c1ccccc1
:
Substrate
Name:
Z-Arg-Arg-AMC
Synonyms:
Benzyloxycarbonyl- L-arginyl- L-arginine- 4-methylcoumaryl-7-amide
Type:
fluorogenic substrate
Mol. Mass.:
358.43
Organism:
Description:
Residue:
3
NA