Target
Glycogen phosphorylase, liver form
Ligand
BDBM35346
Substrate
BDBM24362
Meas. Tech.
Glycogen Phosphorylase Activity Assay
pH
6.8±n/a
Temperature
295.15±n/a K
IC50
920±n/a nM
Citation
 Onda, KSuzuki, TShiraki, RYonetoku, YNegoro, KMomose, KKatayama, NOrita, MYamaguchi, TOhta, MTsukamoto, S Synthesis of 5-chloro-N-aryl-1H-indole-2-carboxamide derivatives as inhibitors of human liver glycogen phosphorylase a. Bioorg Med Chem 16:5452-64 (2008)  
Target
Name:
Glycogen phosphorylase, liver form
Synonyms:
Glycogen Phosphorylase (PYGL) Liver glycogen phosphorylase PYGL_HUMAN
Type:
Homodimer
Mol. Mass.:
97153.98
Organism:
Homo sapiens (Human)
Description:
Dimers associate into a tetramer to form the enzymatically active phosphorylase A.
Residue:
847
  
Inhibitor
Name:
BDBM35346
Synonyms:
(S)-5-chloro-N-(3-(4-fluorophenyl)-1-(4-hydroxypiperidin-1-yl)-1-oxopropan-2-yl)-1H-indole-2-carboxamide 5-Chloro-1H-indole-2-carboxylic acid [(S)-1-(4-fluoro-benzyl)-2-(4-hydroxy-piperidin-1-yl)-2-oxo-ethyl]-amide CP-320626
Type:
Small organic molecule
Emp. Form.:
C23H23ClFN3O3
Mol. Mass.:
443.898
SMILES:
OC1CCN(CC1)C(=O)[C@H](Cc1ccc(F)cc1)NC(=O)c1cc2cc(Cl)ccc2[nH]1
:
Substrate
Name:
BDBM24362
Synonyms:
(glucose)n | glycogen
Type:
polymer of glucose
Emp. Form.:
Mol. Mass.:
SMILES:
: