Target
Vasopressin V2 receptor
Ligand
BDBM35709
Substrate
BDBM35667
Meas. Tech.
Binding Affinity Assay (Ki) and cAMP Accumulation Activity Assay (EC50)
pH
7.4±n/a
Temperature
296.15±n/a K
Ki
0.4±n/a nM
Comments
Not effective on cAMP accumulation.
Citation
 Tsukamoto, IKoshio, HAkamatsu, SKuramochi, TSaitoh, CYatsu, TYanai-Inamura, HKitada, CYamamoto, ESakamoto, STsukamoto, S Preparation of (4,4-difluoro-1,2,3,4-tetrahydro-5H-1-benzazepin-5-ylidene)acetamide derivatives as novel arginine vasopressin V(2) receptor agonists. Bioorg Med Chem 16:9524-35 (2008)  
Target
Name:
Vasopressin V2 receptor
Synonyms:
AVPR V2 Avpr2 V2R_RAT Vasopressin receptor
Type:
G-protein coupled receptor
Mol. Mass.:
40761.85
Organism:
Rattus norvegicus (Rat)
Description:
Residue:
371
  
Inhibitor
Name:
BDBM35709
Synonyms:
YM-35278
Type:
Small organic molecule
Emp. Form.:
C38H30F2N4O3
Mol. Mass.:
628.6666
SMILES:
FC1(F)CCN(C(=O)c2ccc(NC(=O)c3ccccc3-c3ccccc3)cc2)c2ccccc2\C1=C\C(=O)NCc1ccccn1
:
Substrate
Name:
BDBM35667
Synonyms:
AVP US10131692, 44 (AVP) [3H]Argipressin tannate | [3H]vasopressin
Type:
radiolabeled ligand
Emp. Form.:
C46H65N15O12S2
Mol. Mass.:
1084.232
SMILES:
[#7]-[#6@H]-1-[#6]-[#16]-[#16]-[#6]-[#6@H](-[#7]-[#6](=O)-[#6@H](-[#6]-[#6](-[#7])=O)-[#7]-[#6](=O)-[#6@H](-[#6]-[#6]-[#6](-[#7])=O)-[#7]-[#6](=O)-[#6@H](-[#6]-c2ccccc2)-[#7]-[#6](=O)-[#6@H](-[#6]-c2ccc(-[#8])cc2)-[#7]-[#6]-1=O)-[#6](=O)-[#7]-1-[#6]-[#6]-[#6]-[#6@H]-1-[#6](=O)-[#7]-[#6@@H](-[#6]-[#6]-[#6]\[#7]=[#6](\[#7])-[#7])-[#6](=O)-[#7]-[#6]-[#6](-[#7])=O
: