Target
Histone deacetylase 4 [627-1085]
Ligand
BDBM50005711
Substrate
Meas. Tech.
Biochemical Assay
IC50
5780±n/a nM
Citation
 Ma, HWang, Y Histone deacetylase inhibitors and methods for use thereof US Patent  US10011611 Publication Date 7/3/2018 
Target
Name:
Histone deacetylase 4 [627-1085]
Synonyms:
HDAC4 Histone deacetylase 4 (HDAC4) (aa 627-1085) | KIAA0288
Type:
Enzyme Catalytic Domain
Mol. Mass.:
49108.14
Organism:
Homo sapiens (Human)
Description:
aa 627-1085
Residue:
457
  
Inhibitor
Name:
BDBM50005711
Synonyms:
CHEBI:46024 TRICHOSTATIN Trichostatin A (TSA) US10722597, Compound Trichostatin US20230322747, Compound trichostatin A | US9265734, TSA
Type:
Small organic molecule
Emp. Form.:
C17H22N2O3
Mol. Mass.:
302.3682
SMILES:
C[C@H](\C=C(/C)\C=C\C(=O)NO)C(=O)c1ccc(cc1)N(C)C
: