Target
Alpha-carbonic anhydrase domain-containing protein
Ligand
BDBM25906
Substrate
BDBM10856
Meas. Tech.
CA Inhibition Assay
pH
7.4±n/a
Temperature
298.15±n/a K
Ki
13.3±n/a nM
Citation
 Güzel, OInnocenti, AHall, RAScozzafava, AMühlschlegel, FASupuran, CT Carbonic anhydrase inhibitors. The nematode alpha-carbonic anhydrase of Caenorhabditis elegans CAH-4b is highly inhibited by 2-(hydrazinocarbonyl)-3-substituted-phenyl-1H-indole-5-sulfonamides. Bioorg Med Chem 17:3212-5 (2009)  
Target
Name:
Alpha-carbonic anhydrase domain-containing protein
Synonyms:
CAH-4b ceCA
Type:
Enzyme
Mol. Mass.:
26169.24
Organism:
Caenorhabditis elegans
Description:
Q8WQD8
Residue:
235
  
Inhibitor
Name:
BDBM25906
Synonyms:
2-(hydrazinecarbonyl)-3-(3-methylphenyl)-1H-indole-5-sulfonamide indole sulfonamide, 8b
Type:
Small organic molecule
Emp. Form.:
C16H16N4O3S
Mol. Mass.:
344.388
SMILES:
Cc1cccc(c1)-c1c([nH]c2ccc(cc12)S(N)(=O)=O)C(=O)NN
:
Substrate
Name:
BDBM10856
Synonyms:
Carbon Dioxide | methanedione
Type:
Small organic molecule
Emp. Form.:
CO2
Mol. Mass.:
44.0095
SMILES:
O=C=O
: