Target
Alpha-carbonic anhydrase domain-containing protein
Ligand
BDBM10882
Substrate
BDBM10856
Meas. Tech.
CA Inhibition Assay
pH
7.4±n/a
Temperature
298.15±n/a K
Ki
40±n/a nM
Citation
 Güzel, OInnocenti, AHall, RAScozzafava, AMühlschlegel, FASupuran, CT Carbonic anhydrase inhibitors. The nematode alpha-carbonic anhydrase of Caenorhabditis elegans CAH-4b is highly inhibited by 2-(hydrazinocarbonyl)-3-substituted-phenyl-1H-indole-5-sulfonamides. Bioorg Med Chem 17:3212-5 (2009)  
Target
Name:
Alpha-carbonic anhydrase domain-containing protein
Synonyms:
CAH-4b ceCA
Type:
Enzyme
Mol. Mass.:
26169.24
Organism:
Caenorhabditis elegans
Description:
Q8WQD8
Residue:
235
  
Inhibitor
Name:
BDBM10882
Synonyms:
6-ethoxy-1,3-benzothiazole-2-sulfonamide Ethamide Ethoxzolamide Ethoxzolamide, EZM US10172837, Ethoxyzolamide | sulfonamide 3
Type:
Small organic molecule
Emp. Form.:
C9H10N2O3S2
Mol. Mass.:
258.317
SMILES:
CCOc1ccc2nc(sc2c1)S(N)(=O)=O
:
Substrate
Name:
BDBM10856
Synonyms:
Carbon Dioxide | methanedione
Type:
Small organic molecule
Emp. Form.:
CO2
Mol. Mass.:
44.0095
SMILES:
O=C=O
: