Target
Dimer of Gag-Pol polyprotein [489-587]
Ligand
BDBM863
Substrate
HIV Protease Peptide Substrate
Meas. Tech.
Protease Inhibition Assay
pH
6.25±n/a
Temperature
310.15±n/a K
Ki
23.2±n/a nM
Citation
 Ettmayer, PBillich, AHecht, PRosenwirth, BGstach, H Paracyclophanes: a novel class of water-soluble inhibitors of HIV proteinase. J Med Chem 39:3291-9 (1996)  
Target
Name:
Dimer of Gag-Pol polyprotein [489-587]
Synonyms:
HIV-1 Protease
Type:
Protein Complex
Mol. Mass.:
Description:
Components:
This complex has 2 components.
Component 1
Name:
Gag-Pol polyprotein [489-587]
Synonyms:
HIV protease HIV-1 Protease chain A POL_HV1N5 | gag-pol
Type:
Enzyme Subunit
Mol. Mass.:
10822.21
Organism:
Human immunodeficiency virus type 1
Description:
P12497[489-587]
Residue:
99
  
Component 2
Name:
Gag-Pol polyprotein [489-587]
Synonyms:
HIV protease HIV-1 Protease chain A POL_HV1N5 | gag-pol
Type:
Enzyme Subunit
Mol. Mass.:
10822.21
Organism:
Human immunodeficiency virus type 1
Description:
P12497[489-587]
Residue:
99
  
Inhibitor
Name:
BDBM863
Synonyms:
1OH-2(Cbz-Tle)3PhPr [14]paracyclophane deriv. 27 | tert-butyl N-[(1S,2S)-1-[(16R,19R)-15,18-dioxo-16-(propan-2-yl)-2,5,8,11-tetraoxa-14,17,20-triazabicyclo[20.2.2]hexacosa-1(24),22,25-trien-19-yl]-1-hydroxy-3-phenylpropan-2-yl]carbamate
Type:
Small organic molecule
Emp. Form.:
C36H54N4O9
Mol. Mass.:
686.8354
SMILES:
CC(C)C1NC(=O)[C@H](NCc2ccc(OCCOCCOCCOCCNC1=O)cc2)C(O)[C@H](Cc1ccccc1)NC(=O)OC(C)(C)C
:
Substrate
Name:
HIV Protease Peptide Substrate
Synonyms:
Type:
Peptide
Mol. Mass.:
3062.94
Organism:
Synthesized
Description:
Residue:
29