Target
Dimer of Gag-Pol polyprotein [489-587]
Ligand
BDBM868
Substrate
HIV Protease Peptide Substrate
Meas. Tech.
Protease Inhibition Assay
pH
6.25±n/a
Temperature
310.15±n/a K
Ki
68.8±n/a nM
Citation
 Ettmayer, PBillich, AHecht, PRosenwirth, BGstach, H Paracyclophanes: a novel class of water-soluble inhibitors of HIV proteinase. J Med Chem 39:3291-9 (1996)  
Target
Name:
Dimer of Gag-Pol polyprotein [489-587]
Synonyms:
HIV-1 Protease
Type:
Protein Complex
Mol. Mass.:
Description:
Components:
This complex has 2 components.
Component 1
Name:
Gag-Pol polyprotein [489-587]
Synonyms:
HIV protease HIV-1 Protease chain A POL_HV1N5 | gag-pol
Type:
Enzyme Subunit
Mol. Mass.:
10822.21
Organism:
Human immunodeficiency virus type 1
Description:
P12497[489-587]
Residue:
99
  
Component 2
Name:
Gag-Pol polyprotein [489-587]
Synonyms:
HIV protease HIV-1 Protease chain A POL_HV1N5 | gag-pol
Type:
Enzyme Subunit
Mol. Mass.:
10822.21
Organism:
Human immunodeficiency virus type 1
Description:
P12497[489-587]
Residue:
99
  
Inhibitor
Name:
BDBM868
Synonyms:
1OH-2(Cbz-Tle)3PhPr [14]paracyclophane deriv. 17 | tert-butyl N-[(1S,2S)-1-[(10R,13R)-9,12-dioxo-10-(propan-2-yl)-2,5-dioxa-8,11,14-triazabicyclo[14.3.1]icosa-1(19),16(20),17-trien-13-yl]-1-hydroxy-3-phenylpropan-2-yl]carbamate
Type:
Small organic molecule
Emp. Form.:
C32H46N4O7
Mol. Mass.:
598.7302
SMILES:
CC(C)C1NC(=O)[C@H](NCc2cccc(OCCOCCNC1=O)c2)C(O)[C@H](Cc1ccccc1)NC(=O)OC(C)(C)C
:
Substrate
Name:
HIV Protease Peptide Substrate
Synonyms:
Type:
Peptide
Mol. Mass.:
3062.94
Organism:
Synthesized
Description:
Residue:
29