Target
Interleukin-1 receptor-associated kinase 4
Ligand
BDBM402999
Substrate
Meas. Tech.
IRAK4 Enzymatic DELFIA Assay, Protocol A
IC50
0.200±n/a nM
Citation
 Trzupek, JDLee, KLBunnage, MEHan, SHepworth, DLovering, FEMathias, JPPapaioannou, NPierce, BSStrohbach, JWWright, SWZapf, CWGavrin, LKLee, AAnderson, DRCurran, KJDehnhardt, CMSaiah, EGoldberg, JAWang, XHuang, HVargas, RLowe, MDPatny, A Bicyclic-fused heteroaryl or aryl compounds US Patent  US10329302 Publication Date 6/25/2019 
Target
Name:
Interleukin-1 receptor-associated kinase 4
Synonyms:
IRAK-4 IRAK4_HUMAN Interleukin-1 receptor-associated kinase 4 (IRAK4) | Renal carcinoma antigen NY-REN-64
Type:
Protein
Mol. Mass.:
51519.08
Organism:
Homo sapiens (Human)
Description:
Q9NWZ3
Residue:
460
  
Inhibitor
Name:
BDBM402999
Synonyms:
US10329302, Example 146 US11702424, Example 146
Type:
Small organic molecule
Emp. Form.:
C16H15F2N3O4
Mol. Mass.:
351.3048
SMILES:
COc1cc2c(OC[C@@H]3CC(F)(F)C(=O)N3)nccc2cc1C(N)=O
: