Target
TGF-beta receptor type-1
Ligand
BDBM35939
Substrate
BDBM35940
Meas. Tech.
Enzyme Compound Activity (IC50) and Cell Compound Activity (IC50/EC50)
pH
7.4±n/a
Temperature
296.15±n/a K
IC50
44±n/a nM
EC50
55±n/a nM
Citation
 Goldberg, FWWard, RAPowell, SJDebreczeni, JENorman, RARoberts, NJDishington, APGingell, HJWickson, KFRoberts, AL Rapid generation of a high quality lead for transforming growth factor-beta (TGF-beta) type I receptor (ALK5). J Med Chem 52:7901-5 (2009)  
Target
Name:
TGF-beta receptor type-1
Synonyms:
ALK-5 Activin A receptor type II-like protein kinase of 53kD SKR4 TGF-beta receptor type I TGFBR1 TGFR1_HUMAN Transforming growth factor-beta receptor type I
Type:
enzyme
Mol. Mass.:
55968.24
Organism:
Homo sapiens (Human)
Description:
P36897
Residue:
503
  
Inhibitor
Name:
BDBM35939
Synonyms:
4-pyridinoxy-2-anilinopyridine-based compound, 1
Type:
Small organic molecule
Emp. Form.:
C26H26N4O4
Mol. Mass.:
458.509
SMILES:
COc1cc(Nc2cc(Oc3cc(C)c(C)nc3-c3ccccn3)ccn2)cc(OC)c1OC
:
Substrate
Name:
BDBM35940
Synonyms:
((2Z)-3-(6-{4-[2-({4-[(6-chloro[1,3]dioxolo[4,5-b]pyridin-7-yl)amino]-5-(1-methylethoxy)quinazolin-7-yl}oxy)ethyl]piperazin-1-yl}-6-oxohexyl)-2-[(2E,4E)-5-(3-ethyl-1,1-dimethyl-6,8-disulfo-1H-benzo[e] | ALK5 FP probe
Type:
Small organic molecule
Emp. Form.:
Mol. Mass.:
SMILES:
: