Target
Dimer of Gag-Pol polyprotein [501-599,Q508K,L534I,L564I,C568A,C596A]
Ligand
BDBM35982
Substrate
HIV Protease Substrate
Meas. Tech.
Enzyme Inhibition Assay (Ki) and Antiviral Activity Assay (EC50/IC50)
pH
6.4±n/a
Temperature
298.15±n/a K
Ki
0.06±0.01 nM
EC50
7±n/a nM
Citation
 Ghosh, AKKulkarni, SAnderson, DDHong, LBaldridge, AWang, YFChumanevich, AAKovalevsky, AYTojo, YAmano, MKoh, YTang, JWeber, ITMitsuya, H Design, synthesis, protein-ligand X-ray structure, and biological evaluation of a series of novel macrocyclic human immunodeficiency virus-1 protease inhibitors to combat drug resistance. J Med Chem 52:7689-705 (2009)  
Target
Name:
Dimer of Gag-Pol polyprotein [501-599,Q508K,L534I,L564I,C568A,C596A]
Synonyms:
HIV-1 Protease
Type:
Protein Complex
Mol. Mass.:
Description:
Components:
This complex has 2 components.
Component 1
Name:
Gag-Pol polyprotein [501-599,Q508K,L534I,L564I,C568A,C596A]
Synonyms:
HIV-1 Protease chain A gag-pol
Type:
Enzyme Subunit
Mol. Mass.:
10732.11
Organism:
Human immunodeficiency virus type 1
Description:
The HIV-1 protease (Genbank HIVHXB2CG) clone was constructed with the substitutions Q7K, L33I, and L63I, to minimize the autoproteolysis of the protease, and C67A and C95A, to prevent cysteine-thiol oxidation.
Residue:
99
  
Component 2
Name:
Gag-Pol polyprotein [501-599,Q508K,L534I,L564I,C568A,C596A]
Synonyms:
HIV-1 Protease chain A gag-pol
Type:
Enzyme Subunit
Mol. Mass.:
10732.11
Organism:
Human immunodeficiency virus type 1
Description:
The HIV-1 protease (Genbank HIVHXB2CG) clone was constructed with the substitutions Q7K, L33I, and L63I, to minimize the autoproteolysis of the protease, and C67A and C95A, to prevent cysteine-thiol oxidation.
Residue:
99
  
Inhibitor
Name:
BDBM35982
Synonyms:
cyclic compound, 14c-E
Type:
Small organic molecule
Emp. Form.:
C32H42N2O9S
Mol. Mass.:
630.749
SMILES:
[H][C@@]1(CO[C@@]2([H])OCC[C@@]12[H])OC(=O)N[C@@H](Cc1ccccc1)[C@H](O)CN1CCCC\C=C\CCOc2cc(OC)ccc2S1(=O)=O
:
Substrate
Name:
HIV Protease Substrate
Synonyms:
Type:
Fluorogenic peptide
Mol. Mass.:
3467.28
Organism:
Description:
Residue:
30