Target
Kinesin-like protein KIF11 [D130V]
Ligand
BDBM36350
Substrate
Meas. Tech.
HCT116-D130V not selected
pH
6.8±0
IC50
0.45±0.0 nM
Citation
 Luo, LParrish, CANevins, NMcNulty, DEChaudhari, AMCarson, JDSudakin, VShaw, ANLehr, RZhao, HSweitzer, SLad, LWood, KWSakowicz, RAnnan, RSHuang, PSJackson, JRDhanak, DCopeland, RAAuger, KR ATP-competitive inhibitors of the mitotic kinesin KSP that function via an allosteric mechanism. Nat Chem Biol 3:722-6 (2007)  
Target
Name:
Kinesin-like protein KIF11 [D130V]
Synonyms:
EG5 KIF11_HUMAN KSP Mutant (D130V) kinesin spindle protein Mutant (D130V)
Type:
PROTEIN
Mol. Mass.:
119124.02
Organism:
Homo sapiens (Human)
Description:
Kinesin-like spindle protein HKSP
Residue:
1056
  
Inhibitor
Name:
BDBM36350
Synonyms:
6-[4-(Trifluoromethyl)phenyl]-3,4-dihydro-2(1H)-quinolinone GSK-1
Type:
Small organic molecule
Emp. Form.:
C16H12F3NO
Mol. Mass.:
291.2678
SMILES:
FC(F)(F)c1ccc(cc1)-c1ccc2NC(=O)CCc2c1
: