Target
Caspase-3
Ligand
BDBM36364
Substrate
Meas. Tech.
Procaspase-3 Activation Assay
pH
7.4±0
Temperature
310.15±0 K
EC50
4.3e+2±n/a nM
Citation
 Putt, KSChen, GWPearson, JMSandhorst, JSHoagland, MSKwon, JTHwang, SKJin, HChurchwell, MICho, MHDoerge, DRHelferich, WGHergenrother, PJ Small-molecule activation of procaspase-3 to caspase-3 as a personalized anticancer strategy. Nat Chem Biol 2:543-50 (2006)  
Target
Name:
Caspase-3
Synonyms:
Apopain CASP3 CPP-32 Caspase 3 Caspase-3 subunit p17 SCA-1 Yama protein | caspase-3 preproprotein
Type:
Hydrolase; heterotetramer of two heterodimers
Mol. Mass.:
31607.55
Organism:
Homo sapiens (Human)
Description:
Residue:
277
  
Inhibitor
Name:
BDBM36364
Synonyms:
CID9543559 US10166229, Example de-allyl PAC-1
Type:
Small organic molecule
Emp. Form.:
C20H24N4O2
Mol. Mass.:
352.4302
SMILES:
Oc1ccccc1\C=N\NC(=O)CN1CCN(Cc2ccccc2)CC1
: