Target
Nitric oxide synthase, brain
Ligand
BDBM50148164
Substrate
Meas. Tech.
NOS Enzyme Inhibition Assay
pH
7±0
Temperature
310.15±0 K
IC50
3.0e+4±n/a nM
Citation
 Garcin, EDArvai, ASRosenfeld, RJKroeger, MDCrane, BRAndersson, GAndrews, GHamley, PJMallinder, PRNicholls, DJSt-Gallay, SATinker, ACGensmantel, NPMete, ACheshire, DRConnolly, SStuehr, DJAberg, AWallace, AVTainer, JAGetzoff, ED Anchored plasticity opens doors for selective inhibitor design in nitric oxide synthase. Nat Chem Biol 4:700-7 (2008)  
Target
Name:
Nitric oxide synthase, brain
Synonyms:
Constitutive NOS NC-NOS NOS type I nNOS NOS1_HUMAN Neuronal nitric oxide synthase Nitric oxide synthase, neuronal (nNOS) bNOS | nNOS
Type:
Homodimer
Mol. Mass.:
160985.98
Organism:
Homo sapiens (Human)
Description:
P29475
Residue:
1434
  
Inhibitor
Name:
BDBM50148164
Synonyms:
4-(4-Methoxy-pyridin-2-ylamino)-piperidine-1-carboxylic acid ethyl ester Ethyl 4-[(4-methoxypyridin-2-yl)amino]piperidine-1-carboxylate, 11 | ethyl 4-(4-methoxypyridin-2-ylamino)piperidine-1-carboxylate
Type:
Small organic molecule
Emp. Form.:
C14H21N3O3
Mol. Mass.:
279.3348
SMILES:
CCOC(=O)N1CCC(CC1)Nc1cc(OC)ccn1
: