Target
Phospholipase D1
Ligand
BDBM36434
Substrate
Meas. Tech.
293-PLD2 Cell-Based Assay
Temperature
310.15±0 K
EC50
>2000±0 nM
Citation
 Scott, SASelvy, PEBuck, JRCho, HPCriswell, TLThomas, ALArmstrong, MDArteaga, CLLindsley, CWBrown, HA Design of isoform-selective phospholipase D inhibitors that modulate cancer cell invasiveness. Nat Chem Biol 5:108-17 (2009)  
Target
Name:
Phospholipase D1
Synonyms:
Choline phosphatase 1 PLD1 Phosphatidylcholine-hydrolyzing phospholipase D1 Phospholipase D1 Phospholipase D2 (PLD2) | hPLD1
Type:
Protein
Mol. Mass.:
124219.92
Organism:
Homo sapiens (Human)
Description:
Q13393
Residue:
1074
  
Inhibitor
Name:
BDBM36434
Synonyms:
CID25105696 | N-(2-(4-(2-Oxo-2,3-dihydro-1H-benzo[d]imidazol-1-yl)piperidin-1-yl)ethyl)octanamide, 45
Type:
Small organic molecule
Emp. Form.:
C22H34N4O2
Mol. Mass.:
386.531
SMILES:
CCCCCCCC(=O)NCCN1CCC(CC1)n1c2ccccc2[nH]c1=O
: