Target
Mitogen-activated protein kinase 14
Ligand
BDBM36473
Substrate
Meas. Tech.
MAPK p38 Inhibition Assay
pH
9.5±0
Temperature
289.15±0 K
EC50
2.7e+3±n/a nM
Target
Name:
Mitogen-activated protein kinase 14
Synonyms:
CSAID-binding protein CSBP1 CSPB1 MAP kinase 14 MAP kinase p38 alpha MAPK14 MK14_HUMAN Mitogen-activated protein kinase p38 alpha Stress-activated protein kinase 2a | p38 MAP kinase alpha/beta
Type:
Serine/threonine-protein kinase
Mol. Mass.:
41286.76
Organism:
Homo sapiens (Human)
Description:
Q16539
Residue:
360
  
Inhibitor
Name:
BDBM36473
Synonyms:
(S)-3-(2,2-Dimethyl-4H-benzo[d][1,3]dioxin-6-yl)-2-(4-ethoxy-6-(5-(1,2,3,4-tetrahydroquinoline-1-carbonyl)-1H-benzo[d]imidazol-1-yl)-1,3,5-triazin-2-ylamino)-N-methylpropanamide | DEL-B, 14a
Type:
Small organic molecule
Emp. Form.:
C36H38N8O5
Mol. Mass.:
662.7375
SMILES:
CCOc1nc(N[C@@H](Cc2ccc3OC(C)(C)OCc3c2)C(=O)NC)nc(n1)-n1cnc2cc(ccc12)C(=O)N1CCCc2ccccc12
: