Target
Protein kinase C beta type
Ligand
BDBM36605
Substrate
Meas. Tech.
Inhibition Assay
Temperature
303.15±0 K
Ki
>2000±0 nM
Citation
 Koide, KBunnage, MEGomez Paloma, LKanter, JRTaylor, SSBrunton, LLNicolaou, KC Molecular design and biological activity of potent and selective protein kinase inhibitors related to balanol. Chem Biol 2:601-8 (1995)  
Target
Name:
Protein kinase C beta type
Synonyms:
KPCB_RAT Pkcb Prkcb1 Protein kinase C (PKC) | Protein kinase C beta
Type:
Enzyme Mixture
Mol. Mass.:
76755.54
Organism:
Rattus norvegicus (rat)
Description:
PKC from rat brain is known to contain predominately the conventional PKC isoforms, alpha, beta I, beta II, gamma.
Residue:
671
  
Inhibitor
Name:
BDBM36605
Synonyms:
KT5720, 9
Type:
Small organic molecule
Emp. Form.:
C32H31N3O5
Mol. Mass.:
537.6056
SMILES:
CCCCCCOC(=O)[C@@]1(O)CC2O[C@]1(C)n1c3ccccc3c3c4CNC(=O)c4c4c5ccccc5n2c4c13
: